Reaction Details
TargetC-C chemokine receptor type 8
LigandBDBM50203840
Substrate/Competitorn/a
Meas. Tech.ChEMBL_425772 (CHEMBL855762)
Ki 114±n/a nM
Citation Jenkins, TJGuan, BDai, MLi, GLightburn, TEHuang, SFreeze, BSBurdi, DFJacutin-Porte, SBennett, RChen, WMinor, CGhosh, SBlackburn, CGigstad, KMJones, MKolbeck, RYin, WSmith, SCardillo, DOcain, TDHarriman, GC Design, synthesis, and evaluation of naphthalene-sulfonamide antagonists of human CCR8. J Med Chem50:566-84 (2007) 
 
C-C chemokine receptor type 8
Name:C-C chemokine receptor type 8
Type:PROTEIN
Mol. Mass.:40855.53
Organism:Homo sapiens (Human)
Description:ChEMBL_454278
Residue:355
BDBM50203840
NameBDBM50203840
Synonyms:CHEMBL221078 | N-{4-[({1-[4-(dimethylamino)benzoyl]piperidin-4-yl}amino)-sulfonyl]-1-naphthyl}-2-methylbenzamide
TypeSmall organic molecule
Emp. Form.C32H34N4O4S
Mol. Mass.570.702
SMILESCN(C)c1ccc(cc1)C(=O)N1CCC(CC1)NS(=O)(=O)c1ccc(NC(=O)c2ccccc2C)c2ccccc12