Reaction Details
TargetC-C chemokine receptor type 8
LigandBDBM50203860
Substrate/Competitorn/a
Meas. Tech.ChEMBL_425772 (CHEMBL855762)
Ki 34.3±n/a nM
Citation Jenkins, TJGuan, BDai, MLi, GLightburn, TEHuang, SFreeze, BSBurdi, DFJacutin-Porte, SBennett, RChen, WMinor, CGhosh, SBlackburn, CGigstad, KMJones, MKolbeck, RYin, WSmith, SCardillo, DOcain, TDHarriman, GC Design, synthesis, and evaluation of naphthalene-sulfonamide antagonists of human CCR8. J Med Chem50:566-84 (2007) 
 
C-C chemokine receptor type 8
Name:C-C chemokine receptor type 8
Type:PROTEIN
Mol. Mass.:40855.53
Organism:Homo sapiens (Human)
Description:ChEMBL_454278
Residue:355
BDBM50203860
NameBDBM50203860
Synonyms:((+/-)-N-(4-{[(1-butyrylpyrrolidin-3-yl)amino]sulfonyl}-1-naphthyl)-2-methylbenzamide | CHEMBL219327
TypeSmall organic molecule
Emp. Form.C26H29N3O4S
Mol. Mass.479.591
SMILESCCCC(=O)N1CCC(C1)NS(=O)(=O)c1ccc(NC(=O)c2ccccc2C)c2ccccc12