Reaction Details
TargetC-C chemokine receptor type 8
LigandBDBM50203882
Substrate/Competitorn/a
Meas. Tech.ChEMBL_425772 (CHEMBL855762)
Ki 4.2±n/a nM
Citation Jenkins, TJGuan, BDai, MLi, GLightburn, TEHuang, SFreeze, BSBurdi, DFJacutin-Porte, SBennett, RChen, WMinor, CGhosh, SBlackburn, CGigstad, KMJones, MKolbeck, RYin, WSmith, SCardillo, DOcain, TDHarriman, GC Design, synthesis, and evaluation of naphthalene-sulfonamide antagonists of human CCR8. J Med Chem50:566-84 (2007) 
 
C-C chemokine receptor type 8
Name:C-C chemokine receptor type 8
Type:PROTEIN
Mol. Mass.:40855.53
Organism:Homo sapiens (Human)
Description:ChEMBL_454278
Residue:355
BDBM50203882
NameBDBM50203882
Synonyms:2-methyl-N-{4-[1-(4-methyl-piperazine-1-carbonyl)-piperidin-4-ylsulfamoyl]-aphthalen-1-yl}-benzamide | CHEMBL221251
TypeSmall organic molecule
Emp. Form.C29H35N5O4S
Mol. Mass.549.684
SMILESCN1CCN(CC1)C(=O)N1CCC(CC1)NS(=O)(=O)c1ccc(NC(=O)c2ccccc2C)c2ccccc12