Reaction Details
TargetC-C chemokine receptor type 8
LigandBDBM50203890
Substrate/Competitorn/a
Meas. Tech.ChEMBL_425772 (CHEMBL855762)
Ki 7745±n/a nM
Citation Jenkins, TJGuan, BDai, MLi, GLightburn, TEHuang, SFreeze, BSBurdi, DFJacutin-Porte, SBennett, RChen, WMinor, CGhosh, SBlackburn, CGigstad, KMJones, MKolbeck, RYin, WSmith, SCardillo, DOcain, TDHarriman, GC Design, synthesis, and evaluation of naphthalene-sulfonamide antagonists of human CCR8. J Med Chem50:566-84 (2007) 
 
C-C chemokine receptor type 8
Name:C-C chemokine receptor type 8
Type:PROTEIN
Mol. Mass.:40855.53
Organism:Homo sapiens (Human)
Description:ChEMBL_454278
Residue:355
BDBM50203890
NameBDBM50203890
Synonyms:CHEMBL218207 | N-(4-(morpholinosulfonyl)naphthalen-1-yl)benzamide
TypeSmall organic molecule
Emp. Form.C21H20N2O4S
Mol. Mass.396.459
SMILESO=C(Nc1ccc(c2ccccc12)S(=O)(=O)N1CCOCC1)c1ccccc1