Reaction Details
TargetC-C chemokine receptor type 8
LigandBDBM50203909
Substrate/Competitorn/a
Meas. Tech.ChEMBL_425772 (CHEMBL855762)
Ki 71±n/a nM
Citation Jenkins, TJGuan, BDai, MLi, GLightburn, TEHuang, SFreeze, BSBurdi, DFJacutin-Porte, SBennett, RChen, WMinor, CGhosh, SBlackburn, CGigstad, KMJones, MKolbeck, RYin, WSmith, SCardillo, DOcain, TDHarriman, GC Design, synthesis, and evaluation of naphthalene-sulfonamide antagonists of human CCR8. J Med Chem50:566-84 (2007) 
 
C-C chemokine receptor type 8
Name:C-C chemokine receptor type 8
Type:PROTEIN
Mol. Mass.:40855.53
Organism:Homo sapiens (Human)
Description:ChEMBL_454278
Residue:355
BDBM50203909
NameBDBM50203909
Synonyms:4-[4-(2-methyl-benzoylamino)-naphthalene-1-sulfonylamino]-piperidine-1-carboxylic acid (3-morpholin-4-yl-propyl)-amide | CHEMBL218366
TypeSmall organic molecule
Emp. Form.C31H38N4O5S
Mol. Mass.578.722
SMILESCc1ccccc1C(=O)Nc1ccc(c2ccccc12)S(=O)(=O)NC1CCN(CC1)C(=O)CCCN1CCOCC1