Reaction Details
TargetC-C chemokine receptor type 8
LigandBDBM50203908
Substrate/Competitorn/a
Meas. Tech.ChEMBL_425774 (CHEMBL855766)
IC50 5.1±n/a nM
Citation Jenkins, TJGuan, BDai, MLi, GLightburn, TEHuang, SFreeze, BSBurdi, DFJacutin-Porte, SBennett, RChen, WMinor, CGhosh, SBlackburn, CGigstad, KMJones, MKolbeck, RYin, WSmith, SCardillo, DOcain, TDHarriman, GC Design, synthesis, and evaluation of naphthalene-sulfonamide antagonists of human CCR8. J Med Chem50:566-84 (2007) 
 
C-C chemokine receptor type 8
Name:C-C chemokine receptor type 8
Type:PROTEIN
Mol. Mass.:40855.53
Organism:Homo sapiens (Human)
Description:ChEMBL_454278
Residue:355
BDBM50203908
NameBDBM50203908
Synonyms:CHEMBL221790 | N-(4-{[(1-butyrylpiperidin-4-yl)amino]sulfonyl}-1-naphthyl)-3-methylbenzamide
TypeSmall organic molecule
Emp. Form.C27H31N3O4S
Mol. Mass.493.618
SMILESCCCC(=O)N1CCC(CC1)NS(=O)(=O)c1ccc(NC(=O)c2cccc(C)c2)c2ccccc12