Reaction Details
TargetC-C chemokine receptor type 8
LigandBDBM50203920
Substrate/Competitorn/a
Meas. Tech.ChEMBL_425772 (CHEMBL855762)
Ki 1.6±n/a nM
Citation Jenkins, TJGuan, BDai, MLi, GLightburn, TEHuang, SFreeze, BSBurdi, DFJacutin-Porte, SBennett, RChen, WMinor, CGhosh, SBlackburn, CGigstad, KMJones, MKolbeck, RYin, WSmith, SCardillo, DOcain, TDHarriman, GC Design, synthesis, and evaluation of naphthalene-sulfonamide antagonists of human CCR8. J Med Chem50:566-84 (2007) 
 
C-C chemokine receptor type 8
Name:C-C chemokine receptor type 8
Type:PROTEIN
Mol. Mass.:40855.53
Organism:Homo sapiens (Human)
Description:ChEMBL_454278
Residue:355
BDBM50203920
NameBDBM50203920
Synonyms:CHEMBL221867 | N-{4-[1-(4-amino-butyryl)-piperidin-4-ylsulfamoyl]-naphthalen-1-yl}-2-methyl-benzamide
TypeSmall organic molecule
Emp. Form.C27H32N4O4S
Mol. Mass.508.632
SMILESCc1ccccc1C(=O)Nc1ccc(c2ccccc12)S(=O)(=O)NC1CCN(CC1)C(=O)CCCN