Reaction Details
TargetC-C chemokine receptor type 8
LigandBDBM50203925
Substrate/Competitorn/a
Meas. Tech.ChEMBL_425772 (CHEMBL855762)
Ki 7.2±n/a nM
Citation Jenkins, TJGuan, BDai, MLi, GLightburn, TEHuang, SFreeze, BSBurdi, DFJacutin-Porte, SBennett, RChen, WMinor, CGhosh, SBlackburn, CGigstad, KMJones, MKolbeck, RYin, WSmith, SCardillo, DOcain, TDHarriman, GC Design, synthesis, and evaluation of naphthalene-sulfonamide antagonists of human CCR8. J Med Chem50:566-84 (2007) 
 
C-C chemokine receptor type 8
Name:C-C chemokine receptor type 8
Type:PROTEIN
Mol. Mass.:40855.53
Organism:Homo sapiens (Human)
Description:ChEMBL_454278
Residue:355
BDBM50203925
NameBDBM50203925
Synonyms:CHEMBL374979 | N-[4-(1-cyclopropanecarbonyl-piperidin-4-ylsulfamoyl)-naphthalen-1-yl]-2-methyl-benzamide
TypeSmall organic molecule
Emp. Form.C27H29N3O4S
Mol. Mass.491.602
SMILESCc1ccccc1C(=O)Nc1ccc(c2ccccc12)S(=O)(=O)NC1CCN(CC1)C(=O)C1CC1