Reaction Details
TargetC-C chemokine receptor type 8
LigandBDBM50203916
Substrate/Competitorn/a
Meas. Tech.ChEMBL_425772 (CHEMBL855762)
Ki 35.7±n/a nM
Citation Jenkins, TJGuan, BDai, MLi, GLightburn, TEHuang, SFreeze, BSBurdi, DFJacutin-Porte, SBennett, RChen, WMinor, CGhosh, SBlackburn, CGigstad, KMJones, MKolbeck, RYin, WSmith, SCardillo, DOcain, TDHarriman, GC Design, synthesis, and evaluation of naphthalene-sulfonamide antagonists of human CCR8. J Med Chem50:566-84 (2007) 
 
C-C chemokine receptor type 8
Name:C-C chemokine receptor type 8
Type:PROTEIN
Mol. Mass.:40855.53
Organism:Homo sapiens (Human)
Description:ChEMBL_454278
Residue:355
BDBM50203916
NameBDBM50203916
Synonyms:4-[4-(phenethylamino-methyl)-naphthalene-1-sulfonylamino]-piperidine-1-carboxylic acid ethyl ester | CHEMBL222058
TypeSmall organic molecule
Emp. Form.C26H31N3O4S
Mol. Mass.481.607
SMILESCCOC(=O)N1CCC(CC1)NS(=O)(=O)c1ccc(NCCc2ccccc2)c2ccccc12