Reaction Details
TargetAminopeptidase N
LigandBDBM50204163
Substrate/Competitorn/a
Meas. Tech.ChEMBL_438276 (CHEMBL887382)
IC50 530±n/a nM
Citation Drag, MGrzywa, ROleksyszyn, J Novel hydroxamic acid-related phosphinates: inhibition of neutral aminopeptidase N (APN). Bioorg Med Chem Lett17:1516-9 (2007) 
 
Aminopeptidase N
Name:Aminopeptidase N
Type:PROTEIN
Mol. Mass.:109522.63
Organism:Homo sapiens (Human)
Description:ChEMBL_1507526
Residue:967
BDBM50204163
NameBDBM50204163
Synonyms:CHEMBL227345 | alpha1-(1-amino-3-methylbutane)-alpha2-(carbamoylphenyl-methane) phosphinic acid
TypeSmall organic molecule
Emp. Form.C13H21N2O3P
Mol. Mass.284.2912
SMILESCC(C)CC(N)=P(O)(O)C(=O)NCc1ccccc1