Reaction Details
TargetCannabinoid receptor 2
LigandBDBM50204170
Substrate/Competitorn/a
Meas. Tech.ChEMBL_454343 (CHEMBL903521)
IC50 730±n/a nM
Citation Madsen-Duggan, CBDebenham, JSWalsh, TFToupence, RBHuang, SXWang, JTong, XLao, JFong, TMSchaeffer, MTXiao, JCHuang, CRShen, CPStribling, DSShearman, LPStrack, AMMacIntyre, DEVan der Ploeg, LHGoulet, MT Lead optimization of 5,6-diarylpyridines as CB1 receptor inverse agonists. Bioorg Med Chem Lett17:2031-5 (2007) 
 
Cannabinoid receptor 2
Name:Cannabinoid receptor 2
Type:G Protein-Coupled Receptor (GPCR)
Mol. Mass.:39690.94
Organism:Homo sapiens (Human)
Description:P34972
Residue:360
BDBM50204170
NameBDBM50204170
Synonyms:5-(4-chlorophenyl)-6-(2,4-dichlorophenyl)-2-(tetrahydrofuran-3-yloxy)nicotinonitrile | CHEMBL248311
TypeSmall organic molecule
Emp. Form.C22H15Cl3N2O2
Mol. Mass.445.726
SMILESClc1ccc(cc1)-c1cc(C#N)c(OC2CCOC2)nc1-c1ccc(Cl)cc1Cl