Reaction Details
TargetCannabinoid receptor 1
LigandBDBM50204174
Substrate/Competitorn/a
Meas. Tech.ChEMBL_454342 (CHEMBL903520)
IC50 3.7±n/a nM
Citation Madsen-Duggan, CBDebenham, JSWalsh, TFToupence, RBHuang, SXWang, JTong, XLao, JFong, TMSchaeffer, MTXiao, JCHuang, CRShen, CPStribling, DSShearman, LPStrack, AMMacIntyre, DEVan der Ploeg, LHGoulet, MT Lead optimization of 5,6-diarylpyridines as CB1 receptor inverse agonists. Bioorg Med Chem Lett17:2031-5 (2007) 
 
Cannabinoid receptor 1
Name:Cannabinoid receptor 1
Type:G Protein-Coupled Receptor (GPCR)
Mol. Mass.:52868.96
Organism:Homo sapiens (Human)
Description:P21554
Residue:472
BDBM50204174
NameBDBM50204174
Synonyms:5-(4-chlorophenyl)-6-(2,4-dichlorophenyl)-2-(3,4-difluorophenoxy)nicotinonitrile | CHEMBL246723
TypeSmall organic molecule
Emp. Form.C24H11Cl3F2N2O
Mol. Mass.487.713
SMILESFc1ccc(Oc2nc(-c3ccc(Cl)cc3Cl)c(cc2C#N)-c2ccc(Cl)cc2)cc1F