Reaction Details
TargetCannabinoid receptor 1
LigandBDBM50204173
Substrate/Competitorn/a
Meas. Tech.ChEMBL_454342 (CHEMBL903520)
IC50 5.9±n/a nM
Citation Madsen-Duggan, CBDebenham, JSWalsh, TFToupence, RBHuang, SXWang, JTong, XLao, JFong, TMSchaeffer, MTXiao, JCHuang, CRShen, CPStribling, DSShearman, LPStrack, AMMacIntyre, DEVan der Ploeg, LHGoulet, MT Lead optimization of 5,6-diarylpyridines as CB1 receptor inverse agonists. Bioorg Med Chem Lett17:2031-5 (2007) 
 
Cannabinoid receptor 1
Name:Cannabinoid receptor 1
Type:G Protein-Coupled Receptor (GPCR)
Mol. Mass.:52868.96
Organism:Homo sapiens (Human)
Description:P21554
Residue:472
BDBM50204173
NameBDBM50204173
Synonyms:6-(2-chlorophenyl)-5-(4-chlorophenyl)-2-(3,3-dimethylbut-1-ynyl)nicotinonitrile | CHEMBL246899
TypeSmall organic molecule
Emp. Form.C24H18Cl2N2
Mol. Mass.405.319
SMILESCC(C)(C)C#Cc1nc(-c2ccccc2Cl)c(cc1C#N)-c1ccc(Cl)cc1