Reaction Details
TargetCannabinoid receptor 1
LigandBDBM50204185
Substrate/Competitorn/a
Meas. Tech.ChEMBL_454342 (CHEMBL903520)
IC50 4±n/a nM
Citation Madsen-Duggan, CBDebenham, JSWalsh, TFToupence, RBHuang, SXWang, JTong, XLao, JFong, TMSchaeffer, MTXiao, JCHuang, CRShen, CPStribling, DSShearman, LPStrack, AMMacIntyre, DEVan der Ploeg, LHGoulet, MT Lead optimization of 5,6-diarylpyridines as CB1 receptor inverse agonists. Bioorg Med Chem Lett17:2031-5 (2007) 
 
Cannabinoid receptor 1
Name:Cannabinoid receptor 1
Type:G Protein-Coupled Receptor (GPCR)
Mol. Mass.:52868.96
Organism:Homo sapiens (Human)
Description:P21554
Residue:472
BDBM50204185
NameBDBM50204185
Synonyms:2-(3-chlorophenoxy)-5-(4-chlorophenyl)-6-(2,4-dichlorophenyl)nicotinonitrile | CHEMBL246721
TypeSmall organic molecule
Emp. Form.C24H12Cl4N2O
Mol. Mass.486.177
SMILESClc1ccc(cc1)-c1cc(C#N)c(Oc2cccc(Cl)c2)nc1-c1ccc(Cl)cc1Cl