Reaction Details
TargetCannabinoid receptor 1
LigandBDBM50204176
Substrate/Competitorn/a
Meas. Tech.ChEMBL_454342 (CHEMBL903520)
IC50 5.7±n/a nM
Citation Madsen-Duggan, CBDebenham, JSWalsh, TFToupence, RBHuang, SXWang, JTong, XLao, JFong, TMSchaeffer, MTXiao, JCHuang, CRShen, CPStribling, DSShearman, LPStrack, AMMacIntyre, DEVan der Ploeg, LHGoulet, MT Lead optimization of 5,6-diarylpyridines as CB1 receptor inverse agonists. Bioorg Med Chem Lett17:2031-5 (2007) 
 
Cannabinoid receptor 1
Name:Cannabinoid receptor 1
Type:G Protein-Coupled Receptor (GPCR)
Mol. Mass.:52868.96
Organism:Homo sapiens (Human)
Description:P21554
Residue:472
BDBM50204176
NameBDBM50204176
Synonyms:CHEMBL247910 | N-(2-(5-(4-chlorophenyl)-3-cyano-6-(2,4-dichlorophenyl)pyridin-2-yloxy)ethyl)cyclobutanecarboxamide
TypeSmall organic molecule
Emp. Form.C25H20Cl3N3O2
Mol. Mass.500.804
SMILESClc1ccc(cc1)-c1cc(C#N)c(OCCNC(=O)C2CCC2)nc1-c1ccc(Cl)cc1Cl