Reaction Details
TargetCannabinoid receptor 2
LigandBDBM50204178
Substrate/Competitorn/a
Meas. Tech.ChEMBL_454343 (CHEMBL903521)
IC50 1600±n/a nM
Citation Madsen-Duggan, CBDebenham, JSWalsh, TFToupence, RBHuang, SXWang, JTong, XLao, JFong, TMSchaeffer, MTXiao, JCHuang, CRShen, CPStribling, DSShearman, LPStrack, AMMacIntyre, DEVan der Ploeg, LHGoulet, MT Lead optimization of 5,6-diarylpyridines as CB1 receptor inverse agonists. Bioorg Med Chem Lett17:2031-5 (2007) 
 
Cannabinoid receptor 2
Name:Cannabinoid receptor 2
Type:G Protein-Coupled Receptor (GPCR)
Mol. Mass.:39690.94
Organism:Homo sapiens (Human)
Description:P34972
Residue:360
BDBM50204178
NameBDBM50204178
Synonyms:5-(4-chlorophenyl)-6-(2,4-dichlorophenyl)-2-(3,4-difluorophenoxy)-N-isopropylnicotinamide | CHEMBL247307
TypeSmall organic molecule
Emp. Form.C27H19Cl3F2N2O2
Mol. Mass.547.808
SMILESCC(C)NC(=O)c1cc(-c2ccc(Cl)cc2)c(nc1Oc1ccc(F)c(F)c1)-c1ccc(Cl)cc1Cl