Reaction Details
TargetCannabinoid receptor 2
LigandBDBM50204177
Substrate/Competitorn/a
Meas. Tech.ChEMBL_454343 (CHEMBL903521)
IC50 1100±n/a nM
Citation Madsen-Duggan, CBDebenham, JSWalsh, TFToupence, RBHuang, SXWang, JTong, XLao, JFong, TMSchaeffer, MTXiao, JCHuang, CRShen, CPStribling, DSShearman, LPStrack, AMMacIntyre, DEVan der Ploeg, LHGoulet, MT Lead optimization of 5,6-diarylpyridines as CB1 receptor inverse agonists. Bioorg Med Chem Lett17:2031-5 (2007) 
 
Cannabinoid receptor 2
Name:Cannabinoid receptor 2
Type:G Protein-Coupled Receptor (GPCR)
Mol. Mass.:39690.94
Organism:Homo sapiens (Human)
Description:P34972
Residue:360
BDBM50204177
NameBDBM50204177
Synonyms:2-(3-amino-3-ethylpent-1-ynyl)-6-(2-chlorophenyl)-5-(4-chlorophenyl)nicotinonitrile | CHEMBL246901
TypeSmall organic molecule
Emp. Form.C25H21Cl2N3
Mol. Mass.434.36
SMILESCCC(N)(CC)C#Cc1nc(-c2ccccc2Cl)c(cc1C#N)-c1ccc(Cl)cc1