Reaction Details
TargetTyrosine-protein kinase Lck
LigandBDBM50204577
Substrate/Competitorn/a
Meas. Tech.ChEMBL_454458 (CHEMBL902547)
IC50 27±n/a nM
Citation DiMauro, EFNewcomb, JNunes, JJBemis, JEBoucher, CBuchanan, JLBuckner, WHCheng, AFaust, THsieh, FHuang, XLee, JHMarshall, TLMartin, MWMcGowan, DCSchneider, STurci, SMWhite, RDZhu, X Discovery of 4-amino-5,6-biaryl-furo[2,3-d]pyrimidines as inhibitors of Lck: development of an expedient and divergent synthetic route and preliminary SAR. Bioorg Med Chem Lett17:2305-9 (2007) 
 
Tyrosine-protein kinase Lck
Name:Tyrosine-protein kinase Lck
Type:n/a
Mol. Mass.:57987.83
Organism:Homo sapiens (Human)
Description:P06239
Residue:509
BDBM50204577
NameBDBM50204577
Synonyms:6-(4-(morpholinomethyl)phenyl)-5-phenyl-N-(2-(piperazin-1-yl)ethyl)furo[2,3-d]pyrimidin-4-amine | CHEMBL248080
TypeSmall organic molecule
Emp. Form.C29H34N6O2
Mol. Mass.498.6193
SMILESC(CN1CCNCC1)Nc1ncnc2oc(c(-c3ccccc3)c12)-c1ccc(CN2CCOCC2)cc1