Reaction Details
TargetActivated CDC42 kinase 1
LigandBDBM50204575
Substrate/Competitorn/a
Meas. Tech.ChEMBL_454457 (CHEMBL903634)
IC50 97±n/a nM
Citation DiMauro, EFNewcomb, JNunes, JJBemis, JEBoucher, CBuchanan, JLBuckner, WHCheng, AFaust, THsieh, FHuang, XLee, JHMarshall, TLMartin, MWMcGowan, DCSchneider, STurci, SMWhite, RDZhu, X Discovery of 4-amino-5,6-biaryl-furo[2,3-d]pyrimidines as inhibitors of Lck: development of an expedient and divergent synthetic route and preliminary SAR. Bioorg Med Chem Lett17:2305-9 (2007) 
 
Activated CDC42 kinase 1
Name:Activated CDC42 kinase 1
Type:Protein
Mol. Mass.:114577.86
Organism:Homo sapiens (Human)
Description:Q07912
Residue:1038
BDBM50204575
NameBDBM50204575
Synonyms:6-(4-methyl-3,4-dihydro-2H-benzo[b][1,4]oxazin-7-yl)-5-phenyl-N-(2-(piperazin-1-yl)ethyl)furo[2,3-d]pyrimidin-4-amine | CHEMBL248079
TypeSmall organic molecule
Emp. Form.C27H30N6O2
Mol. Mass.470.5661
SMILESCN1CCOc2cc(ccc12)-c1oc2ncnc(NCCN3CCNCC3)c2c1-c1ccccc1