Reaction Details
TargetTyrosine-protein kinase Lck
LigandBDBM50204591
Substrate/Competitorn/a
Meas. Tech.ChEMBL_454458 (CHEMBL902547)
IC50 14±n/a nM
Citation DiMauro, EFNewcomb, JNunes, JJBemis, JEBoucher, CBuchanan, JLBuckner, WHCheng, AFaust, THsieh, FHuang, XLee, JHMarshall, TLMartin, MWMcGowan, DCSchneider, STurci, SMWhite, RDZhu, X Discovery of 4-amino-5,6-biaryl-furo[2,3-d]pyrimidines as inhibitors of Lck: development of an expedient and divergent synthetic route and preliminary SAR. Bioorg Med Chem Lett17:2305-9 (2007) 
 
Tyrosine-protein kinase Lck
Name:Tyrosine-protein kinase Lck
Type:n/a
Mol. Mass.:57987.83
Organism:Homo sapiens (Human)
Description:P06239
Residue:509
BDBM50204591
NameBDBM50204591
Synonyms:5-phenyl-N-(2-(piperidin-4-yl)ethyl)-6-(4-(2-(pyrrolidin-1-yl)ethoxy)phenyl)furo[2,3-d]pyrimidin-4-amine | CHEMBL247469
TypeSmall organic molecule
Emp. Form.C31H37N5O2
Mol. Mass.511.6578
SMILESC(CC1CCNCC1)Nc1ncnc2oc(c(-c3ccccc3)c12)-c1ccc(OCCN2CCCC2)cc1