Reaction Details
TargetActivated CDC42 kinase 1
LigandBDBM50204584
Substrate/Competitorn/a
Meas. Tech.ChEMBL_454457 (CHEMBL903634)
IC50 85±n/a nM
Citation DiMauro, EFNewcomb, JNunes, JJBemis, JEBoucher, CBuchanan, JLBuckner, WHCheng, AFaust, THsieh, FHuang, XLee, JHMarshall, TLMartin, MWMcGowan, DCSchneider, STurci, SMWhite, RDZhu, X Discovery of 4-amino-5,6-biaryl-furo[2,3-d]pyrimidines as inhibitors of Lck: development of an expedient and divergent synthetic route and preliminary SAR. Bioorg Med Chem Lett17:2305-9 (2007) 
 
Activated CDC42 kinase 1
Name:Activated CDC42 kinase 1
Type:Protein
Mol. Mass.:114577.86
Organism:Homo sapiens (Human)
Description:Q07912
Residue:1038
BDBM50204584
NameBDBM50204584
Synonyms:(4-(5-phenyl-4-(2-(piperazin-1-yl)ethylamino)furo[2,3-d]pyrimidin-6-yl)phenyl)(piperidin-1-yl)methanone | CHEMBL248081
TypeSmall organic molecule
Emp. Form.C30H34N6O2
Mol. Mass.510.63
SMILESO=C(N1CCCCC1)c1ccc(cc1)-c1oc2ncnc(NCCN3CCNCC3)c2c1-c1ccccc1