Reaction Details
TargetTyrosine-protein kinase Lck
LigandBDBM50204592
Substrate/Competitorn/a
Meas. Tech.ChEMBL_454458 (CHEMBL902547)
IC50 22±n/a nM
Citation DiMauro, EFNewcomb, JNunes, JJBemis, JEBoucher, CBuchanan, JLBuckner, WHCheng, AFaust, THsieh, FHuang, XLee, JHMarshall, TLMartin, MWMcGowan, DCSchneider, STurci, SMWhite, RDZhu, X Discovery of 4-amino-5,6-biaryl-furo[2,3-d]pyrimidines as inhibitors of Lck: development of an expedient and divergent synthetic route and preliminary SAR. Bioorg Med Chem Lett17:2305-9 (2007) 
 
Tyrosine-protein kinase Lck
Name:Tyrosine-protein kinase Lck
Type:n/a
Mol. Mass.:57987.83
Organism:Homo sapiens (Human)
Description:P06239
Residue:509
BDBM50204592
NameBDBM50204592
Synonyms:6-(3-methoxy-4-(2-(piperidin-1-yl)ethoxy)phenyl)-5-phenyl-N-(2-(piperazin-1-yl)ethyl)furo[2,3-d]pyrimidin-4-amine | CHEMBL394490
TypeSmall organic molecule
Emp. Form.C32H40N6O3
Mol. Mass.556.6984
SMILESCOc1cc(ccc1OCCN1CCCCC1)-c1oc2ncnc(NCCN3CCNCC3)c2c1-c1ccccc1