Reaction Details
TargetSerine/threonine-protein kinase Chk1
LigandBDBM50204726
Substrate/Competitorn/a
Meas. Tech.ChEMBL_442099 (CHEMBL891237)
IC50 6472±n/a nM
Citation Tong, YClaiborne, AStewart, KDPark, CKovar, PChen, ZCredo, RBGu, WZGwaltney, SLJudge, RAZhang, HRosenberg, SHSham, HLSowin, TJLin, NH Discovery of 1,4-dihydroindeno[1,2-c]pyrazoles as a novel class of potent and selective checkpoint kinase 1 inhibitors. Bioorg Med Chem15:2759-67 (2007) 
 
Serine/threonine-protein kinase Chk1
Name:Serine/threonine-protein kinase Chk1
Type:Enzyme Catalytic Domain
Mol. Mass.:54443.02
Organism:Homo sapiens (Human)
Description:gi_166295192
Residue:476
BDBM50204726
NameBDBM50204726
Synonyms:2-(4-(6-(((1s,4s)-4-methylcyclohexylamino)methyl)-1,4-dihydroindeno[1,2-c]pyrazol-3-yl)phenyl)acetic acid | CHEMBL438329
TypeSmall organic molecule
Emp. Form.C26H29N3O2
Mol. Mass.415.5274
SMILESC[C@H]1CC[C@H](CC1)NCc1ccc-2c(Cc3c(n[nH]c-23)-c2ccc(CC(O)=O)cc2)c1