Reaction Details
TargetSerine/threonine-protein kinase Chk1
LigandBDBM50204706
Substrate/Competitorn/a
Meas. Tech.ChEMBL_442099 (CHEMBL891237)
IC50 20±n/a nM
Citation Tong, YClaiborne, AStewart, KDPark, CKovar, PChen, ZCredo, RBGu, WZGwaltney, SLJudge, RAZhang, HRosenberg, SHSham, HLSowin, TJLin, NH Discovery of 1,4-dihydroindeno[1,2-c]pyrazoles as a novel class of potent and selective checkpoint kinase 1 inhibitors. Bioorg Med Chem15:2759-67 (2007) 
 
Serine/threonine-protein kinase Chk1
Name:Serine/threonine-protein kinase Chk1
Type:Enzyme Catalytic Domain
Mol. Mass.:54443.02
Organism:Homo sapiens (Human)
Description:gi_166295192
Residue:476
BDBM50204706
NameBDBM50204706
Synonyms:4-{6-[(cis-4-methyl-cyclohexylamino)-methyl]-1,4-dihydro-indeno[1,2-c]pyrazol-3-yl}-benzoic acid cis-4-(6-((4-methylcyclohexylamino)methyl)-1,4-dihydroindeno[1,2-c]pyrazol-3-yl)benzoic acid
TypeSmall organic molecule
Emp. Form.C25H27N3O2
Mol. Mass.401.5008
SMILESC[C@H]1CC[C@H](CC1)NCc1ccc-2c(Cc3c(n[nH]c-23)-c2ccc(cc2)C(O)=O)c1