Reaction Details
TargetSerine/threonine-protein kinase Chk1
LigandBDBM50204708
Substrate/Competitorn/a
Meas. Tech.ChEMBL_442099 (CHEMBL891237)
IC50 1600±n/a nM
Citation Tong, YClaiborne, AStewart, KDPark, CKovar, PChen, ZCredo, RBGu, WZGwaltney, SLJudge, RAZhang, HRosenberg, SHSham, HLSowin, TJLin, NH Discovery of 1,4-dihydroindeno[1,2-c]pyrazoles as a novel class of potent and selective checkpoint kinase 1 inhibitors. Bioorg Med Chem15:2759-67 (2007) 
 
Serine/threonine-protein kinase Chk1
Name:Serine/threonine-protein kinase Chk1
Type:Enzyme Catalytic Domain
Mol. Mass.:54443.02
Organism:Homo sapiens (Human)
Description:gi_166295192
Residue:476
BDBM50204708
NameBDBM50204708
Synonyms:(1r,4r)-N-((3-(4-ethoxyphenyl)-1,4-dihydroindeno[1,2-c]pyrazol-6-yl)methyl)-4-methylcyclohexanamine | CHEMBL243818
TypeSmall organic molecule
Emp. Form.C26H31N3O
Mol. Mass.401.5438
SMILESCCOc1ccc(cc1)-c1n[nH]c-2c1Cc1cc(CN[C@H]3CC[C@H](C)CC3)ccc-21