Reaction Details
TargetMitogen-activated protein kinase 1
LigandBDBM50204693
Substrate/Competitorn/a
Meas. Tech.ChEMBL_442110 (CHEMBL891248)
IC50>50000±n/a nM
Citation Tong, YClaiborne, AStewart, KDPark, CKovar, PChen, ZCredo, RBGu, WZGwaltney, SLJudge, RAZhang, HRosenberg, SHSham, HLSowin, TJLin, NH Discovery of 1,4-dihydroindeno[1,2-c]pyrazoles as a novel class of potent and selective checkpoint kinase 1 inhibitors. Bioorg Med Chem15:2759-67 (2007) 
 
Mitogen-activated protein kinase 1
Name:Mitogen-activated protein kinase 1
Type:Ser/Thr Protein Kinase
Mol. Mass.:41392.76
Organism:Homo sapiens (Human)
Description:P28482
Residue:360
BDBM50204693
NameBDBM50204693
Synonyms:3-(4'-hydroxy-biphenyl-4-yl)-1,4-dihydro-indeno[1,2-c]pyrazole-6-carboxylic acid (pyridin-4-ylmethyl)-amide | CHEMBL242753
TypeSmall organic molecule
Emp. Form.C29H22N4O2
Mol. Mass.458.5106
SMILESOc1ccc(cc1)-c1ccc(cc1)-c1n[nH]c-2c1Cc1cc(ccc-21)C(=O)NCc1ccncc1