Reaction Details
TargetSerine/threonine-protein kinase Chk1
LigandBDBM50204707
Substrate/Competitorn/a
Meas. Tech.ChEMBL_442102 (CHEMBL891240)
EC50 25000±n/a nM
Citation Tong, YClaiborne, AStewart, KDPark, CKovar, PChen, ZCredo, RBGu, WZGwaltney, SLJudge, RAZhang, HRosenberg, SHSham, HLSowin, TJLin, NH Discovery of 1,4-dihydroindeno[1,2-c]pyrazoles as a novel class of potent and selective checkpoint kinase 1 inhibitors. Bioorg Med Chem15:2759-67 (2007) 
 
Serine/threonine-protein kinase Chk1
Name:Serine/threonine-protein kinase Chk1
Type:Enzyme Catalytic Domain
Mol. Mass.:54443.02
Organism:Homo sapiens (Human)
Description:gi_166295192
Residue:476
BDBM50204707
NameBDBM50204707
Synonyms:CHEMBL242754 | [3-(4'-hydroxy-biphenyl-4-yl)-1,4-dihydro-indeno[1,2-c]pyrazol-6-yl]-(4-hydroxy-piperidin-1-yl)-methanone
TypeSmall organic molecule
Emp. Form.C28H25N3O3
Mol. Mass.451.5164
SMILESOC1CCN(CC1)C(=O)c1ccc-2c(Cc3c(n[nH]c-23)-c2ccc(cc2)-c2ccc(O)cc2)c1