Reaction Details
TargetDelta-type opioid receptor
LigandBDBM50204762
Substrate/Competitorn/a
Meas. Tech.ChEMBL_454477 (CHEMBL886503)
Ki 1906±n/a nM
Citation Caldwell, JPMatasi, JJZhang, HFawzi, ATulshian, DB Synthesis and structure-activity relationships of N-substituted spiropiperidines as nociceptin receptor ligands. Bioorg Med Chem Lett17:2281-4 (2007) 
 
Delta-type opioid receptor
Name:Delta-type opioid receptor
Type:G Protein-Coupled Receptor (GPCR)
Mol. Mass.:40382.98
Organism:Homo sapiens (Human)
Description:Competition binding assays were carried out using membrane preparations from transfected HN9.10 cells that constitutively expressed the delta opioid receptor.
Residue:372
BDBM50204762
NameBDBM50204762
Synonyms:1-phenyl-8-(6,7,8,9-tetrahydro-5H-benzocyclohepten-5-yl)-1,3,8-triaza-spiro[4.5]decan-4-one | CHEMBL442090
TypeSmall organic molecule
Emp. Form.C24H29N3O
Mol. Mass.375.5066
SMILESO=C1NCN(c2ccccc2)C11CCN(CC1)C1CCCCc2ccccc12