Reaction Details
TargetDelta-type opioid receptor
LigandBDBM26919
Substrate/Competitorn/a
Meas. Tech.ChEMBL_454477 (CHEMBL886503)
Ki 1633±n/a nM
Citation Caldwell, JPMatasi, JJZhang, HFawzi, ATulshian, DB Synthesis and structure-activity relationships of N-substituted spiropiperidines as nociceptin receptor ligands. Bioorg Med Chem Lett17:2281-4 (2007) 
 
Delta-type opioid receptor
Name:Delta-type opioid receptor
Type:G Protein-Coupled Receptor (GPCR)
Mol. Mass.:40382.98
Organism:Homo sapiens (Human)
Description:Competition binding assays were carried out using membrane preparations from transfected HN9.10 cells that constitutively expressed the delta opioid receptor.
Residue:372
BDBM26919
NameBDBM26919
Synonyms:8-[(2,6-dichlorophenyl)methyl]-1-phenyl-1,3,8-triazaspiro[4.5]decan-4-one spiropiperidine analogue, 40
TypeSmall organic molecule
Emp. Form.C20H21Cl2N3O
Mol. Mass.390.306
SMILESClc1cccc(Cl)c1CN1CCC2(CC1)N(CNC2=O)c1ccccc1