Reaction Details
TargetDelta-type opioid receptor
LigandBDBM50204776
Substrate/Competitorn/a
Meas. Tech.ChEMBL_454477 (CHEMBL886503)
Ki 2461±n/a nM
Citation Caldwell, JPMatasi, JJZhang, HFawzi, ATulshian, DB Synthesis and structure-activity relationships of N-substituted spiropiperidines as nociceptin receptor ligands. Bioorg Med Chem Lett17:2281-4 (2007) 
 
Delta-type opioid receptor
Name:Delta-type opioid receptor
Type:G Protein-Coupled Receptor (GPCR)
Mol. Mass.:40382.98
Organism:Homo sapiens (Human)
Description:Competition binding assays were carried out using membrane preparations from transfected HN9.10 cells that constitutively expressed the delta opioid receptor.
Residue:372
BDBM50204776
NameBDBM50204776
Synonyms:8-(6-fluoro-4,4-dimethyl-1,2,3,4-tetrahydro-naphthalen-1-yl)-1-phenyl-1,3,8-triaza-spiro[4.5]decan-4-one | CHEMBL241087
TypeSmall organic molecule
Emp. Form.C25H30FN3O
Mol. Mass.407.5236
SMILESCC1(C)CCC(N2CCC3(CC2)N(CNC3=O)c2ccccc2)c2ccc(F)cc12