Reaction Details
TargetNociceptin receptor
LigandBDBM50175929
Substrate/Competitorn/a
Meas. Tech.ChEMBL_454476 (CHEMBL886502)
Ki 11±n/a nM
Citation Caldwell, JPMatasi, JJZhang, HFawzi, ATulshian, DB Synthesis and structure-activity relationships of N-substituted spiropiperidines as nociceptin receptor ligands. Bioorg Med Chem Lett17:2281-4 (2007) 
 
Nociceptin receptor
Name:Nociceptin receptor
Type:G Protein-Coupled Receptor (GPCR)
Mol. Mass.:40702.87
Organism:Homo sapiens (Human)
Description:P41146
Residue:370
BDBM50175929
NameBDBM50175929
Synonyms:8-benzyl-1-phenyl-1,3,8-triaza-spiro[4.5]decan-4-one | CHEMBL203356
TypeSmall organic molecule
Emp. Form.C20H23N3O
Mol. Mass.321.4161
SMILESO=C1NCN(c2ccccc2)C11CCN(Cc2ccccc2)CC1