Reaction Details
TargetKappa-type opioid receptor
LigandBDBM50087008
Substrate/Competitorn/a
Meas. Tech.ChEMBL_454478 (CHEMBL886504)
Ki 32±n/a nM
Citation Caldwell, JPMatasi, JJZhang, HFawzi, ATulshian, DB Synthesis and structure-activity relationships of N-substituted spiropiperidines as nociceptin receptor ligands. Bioorg Med Chem Lett17:2281-4 (2007) 
 
Kappa-type opioid receptor
Name:Kappa-type opioid receptor
Type:G Protein-Coupled Receptor (GPCR)
Mol. Mass.:42648.76
Organism:Homo sapiens (Human)
Description:P41145
Residue:380
BDBM50087008
NameBDBM50087008
Synonyms:8-indan-1-yl-1-phenyl-1,3,8-triaza-spiro[4.5]decan-4-one | CHEMBL284414
TypeSmall organic molecule
Emp. Form.C22H25N3O
Mol. Mass.347.4534
SMILESO=C1NCN(c2ccccc2)C11CCN(CC1)C1CCc2ccccc12