Reaction Details
TargetNociceptin receptor
LigandBDBM50204792
Substrate/Competitorn/a
Meas. Tech.ChEMBL_454476 (CHEMBL886502)
Ki 824±n/a nM
Citation Caldwell, JPMatasi, JJZhang, HFawzi, ATulshian, DB Synthesis and structure-activity relationships of N-substituted spiropiperidines as nociceptin receptor ligands. Bioorg Med Chem Lett17:2281-4 (2007) 
 
Nociceptin receptor
Name:Nociceptin receptor
Type:G Protein-Coupled Receptor (GPCR)
Mol. Mass.:40702.87
Organism:Homo sapiens (Human)
Description:P41146
Residue:370
BDBM50204792
NameBDBM50204792
Synonyms:1-phenyl-8-pyridin-4-ylmethyl-1,3,8-triaza-spiro[4.5]decan-4-one | CHEMBL240897
TypeSmall organic molecule
Emp. Form.C19H22N4O
Mol. Mass.322.4042
SMILESO=C1NCN(c2ccccc2)C11CCN(Cc2ccncc2)CC1