Reaction Details
TargetKappa-type opioid receptor
LigandBDBM50204773
Substrate/Competitorn/a
Meas. Tech.ChEMBL_454478 (CHEMBL886504)
Ki 858±n/a nM
Citation Caldwell, JPMatasi, JJZhang, HFawzi, ATulshian, DB Synthesis and structure-activity relationships of N-substituted spiropiperidines as nociceptin receptor ligands. Bioorg Med Chem Lett17:2281-4 (2007) 
 
Kappa-type opioid receptor
Name:Kappa-type opioid receptor
Type:G Protein-Coupled Receptor (GPCR)
Mol. Mass.:42648.76
Organism:Homo sapiens (Human)
Description:P41145
Residue:380
BDBM50204773
NameBDBM50204773
Synonyms:8-[bis-(2-fluoro-phenyl)-methyl]-1-phenyl-1,3,8-triaza-spiro[4.5]decan-4-one | CHEMBL239820
TypeSmall organic molecule
Emp. Form.C26H25F2N3O
Mol. Mass.433.493
SMILESFc1ccccc1C(N1CCC2(CC1)N(CNC2=O)c1ccccc1)c1ccccc1F