Reaction Details
TargetNociceptin receptor
LigandBDBM50087015
Substrate/Competitorn/a
Meas. Tech.ChEMBL_454476 (CHEMBL886502)
Ki 1.4±n/a nM
Citation Caldwell, JPMatasi, JJZhang, HFawzi, ATulshian, DB Synthesis and structure-activity relationships of N-substituted spiropiperidines as nociceptin receptor ligands. Bioorg Med Chem Lett17:2281-4 (2007) 
 
Nociceptin receptor
Name:Nociceptin receptor
Type:G Protein-Coupled Receptor (GPCR)
Mol. Mass.:40702.87
Organism:Homo sapiens (Human)
Description:P41146
Residue:370
BDBM50087015
NameBDBM50087015
Synonyms:1-Phenyl-8-(1,2,3,4-tetrahydro-naphthalen-1-yl)-1,3,8-triaza-spiro[4.5]decan-4-one | CHEMBL27460
TypeSmall organic molecule
Emp. Form.C23H27N3O
Mol. Mass.361.48
SMILESO=C1NCN(c2ccccc2)C11CCN(CC1)C1CCCc2ccccc12