Reaction Details
TargetNociceptin receptor
LigandBDBM50204785
Substrate/Competitorn/a
Meas. Tech.ChEMBL_454476 (CHEMBL886502)
Ki 1.5±n/a nM
Citation Caldwell, JPMatasi, JJZhang, HFawzi, ATulshian, DB Synthesis and structure-activity relationships of N-substituted spiropiperidines as nociceptin receptor ligands. Bioorg Med Chem Lett17:2281-4 (2007) 
 
Nociceptin receptor
Name:Nociceptin receptor
Type:G Protein-Coupled Receptor (GPCR)
Mol. Mass.:40702.87
Organism:Homo sapiens (Human)
Description:P41146
Residue:370
BDBM50204785
NameBDBM50204785
Synonyms:8-(4-methyl-1-phenyl-pentyl)-1-phenyl-1,3,8-triaza-spiro[4.5]decan-4-one | CHEMBL428033
TypeSmall organic molecule
Emp. Form.C25H33N3O
Mol. Mass.391.549
SMILESCC(C)CCC(N1CCC2(CC1)N(CNC2=O)c1ccccc1)c1ccccc1