Reaction Details
TargetKappa-type opioid receptor
LigandBDBM50204780
Substrate/Competitorn/a
Meas. Tech.ChEMBL_454478 (CHEMBL886504)
Ki 517±n/a nM
Citation Caldwell, JPMatasi, JJZhang, HFawzi, ATulshian, DB Synthesis and structure-activity relationships of N-substituted spiropiperidines as nociceptin receptor ligands. Bioorg Med Chem Lett17:2281-4 (2007) 
 
Kappa-type opioid receptor
Name:Kappa-type opioid receptor
Type:G Protein-Coupled Receptor (GPCR)
Mol. Mass.:42648.76
Organism:Homo sapiens (Human)
Description:P41145
Residue:380
BDBM50204780
NameBDBM50204780
Synonyms:8-cyclohexylmethyl-1-phenyl-1,3,8-triaza-spiro[4.5]decan-4-one | CHEMBL240001
TypeSmall organic molecule
Emp. Form.C20H29N3O
Mol. Mass.327.4638
SMILESO=C1NCN(c2ccccc2)C11CCN(CC2CCCCC2)CC1