Reaction Details
TargetNociceptin receptor
LigandBDBM50204791
Substrate/Competitorn/a
Meas. Tech.ChEMBL_454476 (CHEMBL886502)
Ki 9±n/a nM
Citation Caldwell, JPMatasi, JJZhang, HFawzi, ATulshian, DB Synthesis and structure-activity relationships of N-substituted spiropiperidines as nociceptin receptor ligands. Bioorg Med Chem Lett17:2281-4 (2007) 
 
Nociceptin receptor
Name:Nociceptin receptor
Type:G Protein-Coupled Receptor (GPCR)
Mol. Mass.:40702.87
Organism:Homo sapiens (Human)
Description:P41146
Residue:370
BDBM50204791
NameBDBM50204791
Synonyms:8-di-o-tolylmethyl-1-phenyl-1,3,8-triaza-spiro[4.5]decan-4-one | CHEMBL439212
TypeSmall organic molecule
Emp. Form.C28H31N3O
Mol. Mass.425.5652
SMILESCc1ccccc1C(N1CCC2(CC1)N(CNC2=O)c1ccccc1)c1ccccc1C