Reaction Details
TargetNociceptin receptor
LigandBDBM50204762
Substrate/Competitorn/a
Meas. Tech.ChEMBL_454476 (CHEMBL886502)
Ki 15±n/a nM
Citation Caldwell, JPMatasi, JJZhang, HFawzi, ATulshian, DB Synthesis and structure-activity relationships of N-substituted spiropiperidines as nociceptin receptor ligands. Bioorg Med Chem Lett17:2281-4 (2007) 
 
Nociceptin receptor
Name:Nociceptin receptor
Type:G Protein-Coupled Receptor (GPCR)
Mol. Mass.:40702.87
Organism:Homo sapiens (Human)
Description:P41146
Residue:370
BDBM50204762
NameBDBM50204762
Synonyms:1-phenyl-8-(6,7,8,9-tetrahydro-5H-benzocyclohepten-5-yl)-1,3,8-triaza-spiro[4.5]decan-4-one | CHEMBL442090
TypeSmall organic molecule
Emp. Form.C24H29N3O
Mol. Mass.375.5066
SMILESO=C1NCN(c2ccccc2)C11CCN(CC1)C1CCCCc2ccccc12