Reaction Details
TargetEstrogen receptor beta
LigandBDBM50204812
Substrate/Competitorn/a
Meas. Tech.ChEMBL_454489 (CHEMBL886515)
IC50 2338±n/a nM
Citation Dykstra, KDGuo, LBirzin, ETChan, WYang, YTHayes, ECDaSilva, CAPai, LYMosley, RTKraker, BFitzgerald, PMDiNinno, FRohrer, SPSchaeffer, JMHammond, ML Estrogen receptor ligands. Part 16: 2-Aryl indoles as highly subtype selective ligands for ERalpha. Bioorg Med Chem Lett17:2322-8 (2007) 
 
Estrogen receptor beta
Name:Estrogen receptor beta
Type:Protein
Mol. Mass.:59238.43
Organism:Homo sapiens (Human)
Description:Q92731
Residue:530
BDBM50204812
NameBDBM50204812
Synonyms:(R)-N-(4-(4-hydroxyphenyl)butan-2-yl)-2-(2-phenyl-7-(5-(piperidin-1-yl)pentyloxy)-1H-indol-3-yl)acetamide | CHEMBL241257
TypeSmall organic molecule
Emp. Form.C36H45N3O3
Mol. Mass.567.7608
SMILESC[C@H](CCc1ccc(O)cc1)NC(=O)Cc1c([nH]c2c(OCCCCCN3CCCCC3)cccc12)-c1ccccc1