Reaction Details
TargetAndrogen receptor
LigandBDBM50205099
Substrate/Competitorn/a
Meas. Tech.ChEMBL_438313 (CHEMBL887415)
Ki 8.1±n/a nM
Citation Hamann, LGManfredi, MCSun, CKrystek, SRHuang, YBi, YAugeri, DJWang, TZou, YBetebenner, DAFura, ASeethala, RGolla, RKuhns, JELupisella, JADarienzo, CJCuster, LLPrice, JLJohnson, JMBiller, SAZahler, ROstrowski, J Tandem optimization of target activity and elimination of mutagenic potential in a potent series of N-aryl bicyclic hydantoin-based selective androgen receptor modulators. Bioorg Med Chem Lett17:1860-4 (2007) 
 
Androgen receptor
Name:Androgen receptor
Type:Receptor
Mol. Mass.:99185.27
Organism:Homo sapiens (Human)
Description:CHO cells were stably transfected with human AR gene.
Residue:920
BDBM50205099
NameBDBM50205099
Synonyms:4-((7R,7aS)-7-hydroxy-1,3-dioxo-tetrahydro-1H-pyrrolo[1,2-e]imidazol-2(3H)-yl)-3-methoxy-2-methylbenzonitrile | CHEMBL395502
TypeSmall organic molecule
Emp. Form.C15H15N3O4
Mol. Mass.301.2973
SMILESCOc1c(C)c(ccc1-n1c(O)c2[C@H](O)CCn2c1=O)C#N