Reaction Details
TargetAndrogen receptor
LigandBDBM50205105
Substrate/Competitorn/a
Meas. Tech.ChEMBL_438313 (CHEMBL887415)
Ki 34±n/a nM
Citation Hamann, LGManfredi, MCSun, CKrystek, SRHuang, YBi, YAugeri, DJWang, TZou, YBetebenner, DAFura, ASeethala, RGolla, RKuhns, JELupisella, JADarienzo, CJCuster, LLPrice, JLJohnson, JMBiller, SAZahler, ROstrowski, J Tandem optimization of target activity and elimination of mutagenic potential in a potent series of N-aryl bicyclic hydantoin-based selective androgen receptor modulators. Bioorg Med Chem Lett17:1860-4 (2007) 
 
Androgen receptor
Name:Androgen receptor
Type:Receptor
Mol. Mass.:99185.27
Organism:Homo sapiens (Human)
Description:CHO cells were stably transfected with human AR gene.
Residue:920
BDBM50205105
NameBDBM50205105
Synonyms:4-((7R,7aS)-7-hydroxy-1,3-dioxo-tetrahydro-1H-pyrrolo[1,2-e]imidazol-2(3H)-yl)benzonitrile | CHEMBL388210
TypeSmall organic molecule
Emp. Form.C13H11N3O3
Mol. Mass.257.2447
SMILESO[C@@H]1CCn2c1c(O)n(-c1ccc(cc1)C#N)c2=O