Reaction Details
TargetCannabinoid receptor 2
LigandBDBM50205160
Substrate/Competitorn/a
Meas. Tech.ChEMBL_438314 (CHEMBL887422)
IC50 300.8±n/a nM
Citation Armstrong, HEGalka, ALin, LSLanza, TJJewell, JPShah, SKGuthikonda, RTruong, QChang, LLQuaker, GColandrea, VJTong, XWang, JXu, SFong, TMShen, CPLao, JChen, JShearman, LPStribling, DSRosko, KStrack, AHa, SVan der Ploeg, LGoulet, MTHagmann, WK Substituted acyclic sulfonamides as human cannabinoid-1 receptor inverse agonists. Bioorg Med Chem Lett17:2184-7 (2007) 
 
Cannabinoid receptor 2
Name:Cannabinoid receptor 2
Type:G Protein-Coupled Receptor (GPCR)
Mol. Mass.:39690.94
Organism:Homo sapiens (Human)
Description:P34972
Residue:360
BDBM50205160
NameBDBM50205160
Synonyms:2,4-dichloro-N-((2S,3S)-4-(4-chlorophenyl)-3-(3-cyanophenyl)butan-2-yl)benzenesulfonamide | CHEMBL230923
TypeSmall organic molecule
Emp. Form.C23H19Cl3N2O2S
Mol. Mass.493.833
SMILESC[C@H](NS(=O)(=O)c1ccc(Cl)cc1Cl)[C@@H](Cc1ccc(Cl)cc1)c1cccc(c1)C#N