Reaction Details
TargetCannabinoid receptor 1
LigandBDBM50205160
Substrate/Competitorn/a
Meas. Tech.ChEMBL_438315 (CHEMBL887423)
IC50 7.1±n/a nM
Citation Armstrong, HEGalka, ALin, LSLanza, TJJewell, JPShah, SKGuthikonda, RTruong, QChang, LLQuaker, GColandrea, VJTong, XWang, JXu, SFong, TMShen, CPLao, JChen, JShearman, LPStribling, DSRosko, KStrack, AHa, SVan der Ploeg, LGoulet, MTHagmann, WK Substituted acyclic sulfonamides as human cannabinoid-1 receptor inverse agonists. Bioorg Med Chem Lett17:2184-7 (2007) 
 
Cannabinoid receptor 1
Name:Cannabinoid receptor 1
Type:G Protein-Coupled Receptor (GPCR)
Mol. Mass.:52868.96
Organism:Homo sapiens (Human)
Description:P21554
Residue:472
BDBM50205160
NameBDBM50205160
Synonyms:2,4-dichloro-N-((2S,3S)-4-(4-chlorophenyl)-3-(3-cyanophenyl)butan-2-yl)benzenesulfonamide | CHEMBL230923
TypeSmall organic molecule
Emp. Form.C23H19Cl3N2O2S
Mol. Mass.493.833
SMILESC[C@H](NS(=O)(=O)c1ccc(Cl)cc1Cl)[C@@H](Cc1ccc(Cl)cc1)c1cccc(c1)C#N