Reaction Details
TargetCannabinoid receptor 1
LigandBDBM50205184
Substrate/Competitorn/a
Meas. Tech.ChEMBL_438315 (CHEMBL887423)
IC50 20.9±n/a nM
Citation Armstrong, HEGalka, ALin, LSLanza, TJJewell, JPShah, SKGuthikonda, RTruong, QChang, LLQuaker, GColandrea, VJTong, XWang, JXu, SFong, TMShen, CPLao, JChen, JShearman, LPStribling, DSRosko, KStrack, AHa, SVan der Ploeg, LGoulet, MTHagmann, WK Substituted acyclic sulfonamides as human cannabinoid-1 receptor inverse agonists. Bioorg Med Chem Lett17:2184-7 (2007) 
 
Cannabinoid receptor 1
Name:Cannabinoid receptor 1
Type:G Protein-Coupled Receptor (GPCR)
Mol. Mass.:52868.96
Organism:Homo sapiens (Human)
Description:P21554
Residue:472
BDBM50205184
NameBDBM50205184
Synonyms:CHEMBL230927 | N-((2S,3S)-4-(4-chlorophenyl)-3-(3-cyanophenyl)butan-2-yl)(phenyl)methanesulfonamide
TypeSmall organic molecule
Emp. Form.C24H23ClN2O2S
Mol. Mass.438.97
SMILESC[C@H](NS(=O)(=O)Cc1ccccc1)[C@@H](Cc1ccc(Cl)cc1)c1cccc(c1)C#N