Reaction Details
TargetCannabinoid receptor 2
LigandBDBM50205170
Substrate/Competitorn/a
Meas. Tech.ChEMBL_438314 (CHEMBL887422)
IC50>2000±n/a nM
Citation Armstrong, HEGalka, ALin, LSLanza, TJJewell, JPShah, SKGuthikonda, RTruong, QChang, LLQuaker, GColandrea, VJTong, XWang, JXu, SFong, TMShen, CPLao, JChen, JShearman, LPStribling, DSRosko, KStrack, AHa, SVan der Ploeg, LGoulet, MTHagmann, WK Substituted acyclic sulfonamides as human cannabinoid-1 receptor inverse agonists. Bioorg Med Chem Lett17:2184-7 (2007) 
 
Cannabinoid receptor 2
Name:Cannabinoid receptor 2
Type:G Protein-Coupled Receptor (GPCR)
Mol. Mass.:39690.94
Organism:Homo sapiens (Human)
Description:P34972
Residue:360
BDBM50205170
NameBDBM50205170
Synonyms:CHEMBL230067 | N-((2S,3S)-4-(4-chlorophenyl)-3-(3-cyanophenyl)butan-2-yl)-N-methylmethanesulfonamide
TypeSmall organic molecule
Emp. Form.C19H21ClN2O2S
Mol. Mass.376.9
SMILESC[C@@H]([C@@H](Cc1ccc(Cl)cc1)c1cccc(c1)C#N)N(C)S(C)(=O)=O