Reaction Details
TargetThromboxane A2 receptor
LigandBDBM50184212
Substrate/Competitorn/a
Meas. Tech.ChEMBL_425871 (CHEMBL856875)
Ki 1200±n/a nM
Citation Sturino, CFO'Neill, GLachance, NBoyd, MBerthelette, CLabelle, MLi, LRoy, BScheigetz, JTsou, NAubin, YBateman, KPChauret, NDay, SHLévesque, JFSeto, CSilva, JHTrimble, LACarriere, MCDenis, DGreig, GKargman, SLamontagne, SMathieu, MCSawyer, NSlipetz, DAbraham, WMJones, TMcAuliffe, MPiechuta, HNicoll-Griffith, DAWang, ZZamboni, RYoung, RNMetters, KM Discovery of a potent and selective prostaglandin D2 receptor antagonist, [(3R)-4-(4-chloro-benzyl)-7-fluoro-5-(methylsulfonyl)-1,2,3,4-tetrahydrocyclopenta[b]indol-3-yl]-acetic acid (MK-0524). J Med Chem50:794-806 (2007) 
 
Thromboxane A2 receptor
Name:Thromboxane A2 receptor
Type:Enyzme
Mol. Mass.:37445.28
Organism:Homo sapiens (Human)
Description:P21731
Residue:343
BDBM50184212
NameBDBM50184212
Synonyms:(R)-2-(4-(4-chlorobenzyl)-5-acetyl-7-(methylsulfonyl)-1,2,3,4-tetrahydrocyclopenta[b]indol-3-yl)acetic acid [(3R)-5-acetyl-4-(4-chlorobenzyl)-7-(methylsulfonyl)-1,2,3,4-tetrahydrocyclopenta[b]indol-3-yl]acetic acid | [(R)-5-Acetyl-4-(4-chloro-benzyl)-7-methanesulfonyl-1,2,3,4-tetrahydro-cyclopenta[b]indol-3-yl]-acetic acid
TypeSmall organic molecule
Emp. Form.C23H22ClNO5S
Mol. Mass.459.942
SMILESCC(=O)c1cc(cc2c3CC[C@H](CC(O)=O)c3n(Cc3ccc(Cl)cc3)c12)S(C)(=O)=O