Reaction Details
TargetKappa-type opioid receptor
LigandBDBM50205444
Substrate/Competitorn/a
Meas. Tech.ChEMBL_438364 (CHEMBL887466)
Ki 546±n/a nM
Citation Bikbulatov, RVYan, FRoth, BLZjawiony, JK Convenient synthesis and in vitro pharmacological activity of 2-thioanalogs of salvinorins A and B. Bioorg Med Chem Lett17:2229-32 (2007) 
 
Kappa-type opioid receptor
Name:Kappa-type opioid receptor
Type:G Protein-Coupled Receptor (GPCR)
Mol. Mass.:42692.90
Organism:Rattus norvegicus (rat)
Description:P34975
Residue:380
BDBM50205444
NameBDBM50205444
Synonyms:2-epi-2-thiosalvinorin B | CHEMBL231638
TypeSmall organic molecule
Emp. Form.C21H26O6S
Mol. Mass.406.493
SMILESCOC(=O)[C@@H]1C[C@@H](S)C(=O)[C@H]2[C@@]1(C)CC[C@H]1C(=O)O[C@@H](C[C@]21C)c1ccoc1