Reaction Details
TargetPotassium voltage-gated channel subfamily H member 2
LigandBDBM50205453
Substrate/Competitorn/a
Meas. Tech.ChEMBL_438371 (CHEMBL886338)
Ki 85000±n/a nM
Citation Murphy, STCase, HLEllsworth, EHagen, SHuband, MJoannides, TLimberakis, CMarotti, KROttolini, AMRauckhorst, MStarr, JStier, MTaylor, CZhu, TBlaser, ADenny, WALu, GLSmaill, JBRivault, F The synthesis and biological evaluation of novel series of nitrile-containing fluoroquinolones as antibacterial agents. Bioorg Med Chem Lett17:2150-5 (2007) 
 
Potassium voltage-gated channel subfamily H member 2
Name:Potassium voltage-gated channel subfamily H member 2
Type:Multi-pass membrane protein
Mol. Mass.:126672.65
Organism:Homo sapiens (Human)
Description:Q12809
Residue:1159
BDBM50205453
NameBDBM50205453
Synonyms:7-((R)-3-((S)-1-aminoethyl)pyrrolidin-1-yl)-1-cyclopropyl-6-fluoro-8-methoxy-4-oxo-1,4-dihydroquinoline-3-carboxylic acid | CHEMBL230598
TypeSmall organic molecule
Emp. Form.C20H24FN3O4
Mol. Mass.389.4207
SMILESCOc1c(N2CC[C@H](C2)[C@H](C)N)c(F)cc2c1n(cc(C(O)=O)c2=O)C1CC1