Reaction Details
TargetPotassium voltage-gated channel subfamily H member 2
LigandBDBM50205454
Substrate/Competitorn/a
Meas. Tech.ChEMBL_438371 (CHEMBL886338)
Ki>150000±n/a nM
Citation Murphy, STCase, HLEllsworth, EHagen, SHuband, MJoannides, TLimberakis, CMarotti, KROttolini, AMRauckhorst, MStarr, JStier, MTaylor, CZhu, TBlaser, ADenny, WALu, GLSmaill, JBRivault, F The synthesis and biological evaluation of novel series of nitrile-containing fluoroquinolones as antibacterial agents. Bioorg Med Chem Lett17:2150-5 (2007) 
 
Potassium voltage-gated channel subfamily H member 2
Name:Potassium voltage-gated channel subfamily H member 2
Type:Multi-pass membrane protein
Mol. Mass.:126672.65
Organism:Homo sapiens (Human)
Description:Q12809
Residue:1159
BDBM50205454
NameBDBM50205454
Synonyms:10-((R)-3-((S)-2-cyano-1-(methylamino)ethyl)pyrrolidin-1-yl)-9-fluoro-3-methyl-7-oxo-3,7-dihydro-2H-[1,4]oxazino[2,3,4-ij]quinoline-6-carboxylic acid | CHEMBL230915
TypeSmall organic molecule
Emp. Form.C21H23FN4O4
Mol. Mass.414.4301
SMILESCN[C@@H](CC#N)[C@@H]1CCN(C1)c1c(F)cc2c3c1OCC(C)n3cc(C(O)=O)c2=O